{"text_format":"1","workbook":"xlsx","n_sheets":16,"sheets":["INSTRUCTIONS","BUDGET","Journal","Outbound Details","Inbound Details","Inbound Budget Report","Welcome","Escapade Eskimo","Museum of History","Curling-Ice fishing","Winterlude","Omega Park","Parliament","Event 8","Farewell","SUMMARY-SOURCE & USE OF FUNDS"],"not_rendered":{"charts":0,"images":27,"macros":1,"external_links":0,"defined_names":3,"comments":0,"pivot_tables":0},"unopened":[],"bounds":{"document_bytes":16777216,"sheet_cells":100000,"rows_first":2000,"rows_last":500,"rows_between":2000,"halvings":0,"cell_chars":16384,"cell_head_chars":4096},"cells_cut":0,"cells_raw":0,"read":"whole","date_system":"1900"}

{"sheet":"INSTRUCTIONS","index":0,"n_rows":389,"n_cols":11,"rows_kept":389,"cut":false,"hidden":false,"merged":[]}
[null,"BEWARE",null,"OVERVIEW:",null,null,"SPECIAL NOTES",null,null,"PROGRAMMING NOTES"]
[null,"Macros must be enabled for full functionality",null,null,"Each Journey is required to plan, monitor and report on their activities.  The following forms",null,null,"If Macros are enabled, only the applicable worksheets and the "]
[null,"Refer to Macros Setting and Macros Enabling",null,null,"are designed to help Journey Treasurers (JT) perform this function in a consistent and uniform ",null,null,"applicable Budget rows will appear when \"Inbound\" or ",null,"1.       ","Differences between the Excel and the Calc templates:"]
[null,null,null,null,"fashion. ",null,null,"\"Outbound\" is selected in cell B1 of the Budget worksheet"]
[null,"Table of Content",null,null,null,null,null,null,null,"a.   ","The Macros are written in a different language which are not "]
[null,null,null,null,"There is usually more involved in the reporting of an Inbound Journey than an Outbound ",null,null,"Macros must be enable for the Inbound Budget Report button to ",null,null,"compatible with each other (specially the API):"]
[1,"Overview","D1",null,"Journey. The forms have been developed therefore to meet the needs of an Inbound Journey.  ",null,null,"work",null,null,"    Excel macros are writen in Visual Basic for Applications"]
[1.1000000000000001,"Budget tab","D42",null,"Having said that, the same forms can equally be used for an Outbound Journey, although some ",null,null,null,null,null,"    Calc macros are written in OpenOffice Basic"]
{"$rows_left_out":382}
{"sheet":"BUDGET","index":1,"n_rows":66,"n_cols":25,"rows_kept":66,"cut":false,"hidden":false,"merged":[[0,7,1,7],[57,11,57,12],[62,11,62,12],[41,1,41,7],[3,12,3,14],[3,6,3,8],[3,3,3,5],[3,9,3,11],[41,8,41,14]]}
[null,"Choose Inbound or Outbound",null,"Journey #: ",41248,"Arrival date: ","2020-02-05","Number of Ambassadors:",null,null,"60 days prior start:  ",{"$f":"IF(ISNUMBER(G1),G1-60,\"\")","v":"2019-12-07"},null,"6 months prior start:  ",{"$f":"IF(ISNUMBER(G1),G1-180,\"\")","v":"2019-08-09"},null,null,null,null,null,null,null,"B1 Drop Down  menu list","K58 & K63 Drop Down menu list","Prev. cell B1 content"]
["Club name: ","FF Saturnalia",null,"Date format: ","dd mmm yyyy","Departure date: ","2020-02-12",null,15,null,"90 days prior start:  ",{"$f":"IF(ISNUMBER(G1),G1-90,\"\")","v":"2019-11-07"},null,null,null,null,null,null,null,null,null,null,"Choose Inbound or Outbound","Click to Select Currency","Choose Inbound or Outbound"]
[null,{"$f":"\"BUDGET for \" & IF(B1 = \"Choose Inbound or Outbound\",\"\",B1& \" \") & \"Journey \" &IF(ISNUMBER(E1),\"# \"&E1& \", \"& B2,\"\")","v":"BUDGET for Journey # 41248, FF Saturnalia"},null,null,null,null,null,null,null,null,null,null,null,null,null,null,null,null,null,null,null,null,"Inbound","American Dollar (USD)"]
[null,null,null,"ESTIMATED EXPENSE BUDGET",null,null,"TO COLLECT FROM AMBASSADORS",null,null,"TO COLLECT FROM HOSTS",null,null,"Miscellaneous Funds",null,null,"Remarks",null,null,null,null,null,null,"Outbound","European Euro (EUR)"]
["Inbound Outbound or both","Item",null,"Qty","Unit Price","Total Cost","Qty","Unit Price","Total Funds from Ambassadors","Qty","Unit Price","Total Funds from Hosts","Qty","Unit Price","Total Misc. Funds",null,null,null,null,null,null,null,null,"New Zealand Dollar (NZD)"]
["Inbound",{"$f":"Welcome!G19","v":"Welcome"},null,null,null,{"$f":"IF(Welcome!N$21>0,Welcome!N$21,\"\")","v":498.88},{"$f":"IF(Welcome!H$19>0,Welcome!F$19,\" \")","v":15},{"$f":"IF(Welcome!H$19>0,Welcome!H$19,\" \")","v":23.925333333333334},{"$f":"IF(Welcome!N$7>0,Welcome!N$7,\"\")","v":358.88},null,null,{"$f":"IF(Welcome!N$8>0,Welcome!N$8,\"\")","v":140},null,null,{"$f":"IF(Welcome!N$9>0,Welcome!N$9,\"\")","v":""},null,null,null,null,null,null,null,null,"Australian Dollar (AUD)"]
["Inbound",{"$f":"'Escapade Eskimo'!G19","v":"Escapade Eskimo"},null,null,null,{"$f":"IF('Escapade Eskimo'!N$21>0,'Escapade Eskimo'!N$21,\"\")","v":1555},{"$f":"IF('Escapade Eskimo'!H$19>0,'Escapade Eskimo'!F$19,\" \")","v":15},{"$f":"IF('Escapade Eskimo'!H$19>0,'Escapade Eskimo'!H$19,\" \")","v":85.333333333333329},{"$f":"IF('Escapade Eskimo'!N$7>0,'Escapade Eskimo'!N$7,\"\")","v":1280},null,null,{"$f":"IF('Escapade Eskimo'!N$8>0,'Escapade Eskimo'!N$8,\"\")","v":275},null,null,{"$f":"IF('Museum of History'!N$9>0,'Museum of History'!N$9,\"\")","v":""}]
["Inbound",{"$f":"'Museum of History'!G19","v":"Museum of History"},null,null,null,{"$f":"IF('Museum of History'!N$21>0,'Museum of History'!N$21,\"\")","v":675},{"$f":"IF('Museum of History'!H$19>0,'Museum of History'!F$19,\" \")","v":15},{"$f":"IF('Museum of History'!H$19>0,'Museum of History'!H$19,\" \")","v":38.666666666666664},{"$f":"IF('Museum of History'!N$7>0,'Museum of History'!N$7,\"\")","v":580},null,null,{"$f":"IF('Museum of History'!N$8>0,'Museum of History'!N$8,\"\")","v":95},null,null,{"$f":"IF('Curling-Ice fishing'!N$9>0,'Curling-Ice fishing'!N$9,\"\")","v":""}]
{"$rows_left_out":59}
{"sheet":"Journal","index":2,"n_rows":119,"n_cols":10,"rows_kept":119,"cut":false,"hidden":false,"merged":[[0,8,0,9]]}
["JOURNAL",null,{"$f":"IF(ROUND(F119-F77,2)=0,\"Item names match Budget\",\"ERROR, Item name does not match Budget\")","v":"Item names match Budget"},null,null,null,null,null,"Bank Reconciliation"]
["Date","chq # Deposit #","Item\n(exactly as typed in Budget otherwise ERROR)","Deposit","Withdrawal","Balance","Receipt #","Description","If item is in bank Statement","Bank\nBalance"]
["2019-12-01",null,"Opening Balance",null,null,0,null,null,"Enter \"y\" ",{"$f":"F3","v":0}]
["2019-12-01","Dep 01","Host Receipts",1280,null,{"$f":"ROUND(+F3+D4-E4,2)","v":1280},null,"Payment from the 15 hosts participating in the events","y",{"$f":"IF(UPPER(I4)=\"Y\",ROUND(J3+D4-E4,2),J3)","v":1280}]
["2019-12-07","WT 01","Ambassador Receipts",5285.8,null,{"$f":"ROUND(+F4+D5-E5,2)","v":6565.8},1,"Ambassador's hosting fee $4005 USD @ 1.3198","y",{"$f":"IF(UPPER(I5)=\"Y\",ROUND(J4+D5-E5,2),J4)","v":6565.8}]
["2019-12-07","WT 01","Wire Transfer Fee",null,14,6551.8,1,null,"y",6551.8]
["2019-12-15","CK 01","Escapade Eskimo",null,200,6351.8,2,"Deposit Payment to Eskim Inc.","y",6351.8]
["2019-12-31","SC","Bank Fees",null,2.5,6349.3,null,null,"y",6349.3]
{"$rows_left_out":112}
{"sheet":"Outbound Details","index":3,"n_rows":57,"n_cols":21,"rows_kept":57,"cut":false,"hidden":false,"merged":[[0,19,1,19],[0,20,1,20],[0,2,0,7],[0,9,0,17],[0,0,1,0],[0,1,1,1],[0,18,1,18],[56,3,56,4],[56,5,56,9],[53,3,53,4],[53,5,53,9],[54,3,54,4],[54,5,54,9],[55,3,55,4],[55,5,55,9],[50,3,50,4],[50,5,50,9],[51,3,51,4],[51,5,51,9],[52,3,52,4],[52,5,52,9],[47,3,47,4],[47,5,47,9],[48,3,48,4],[48,5,48,9],[49,3,49,4],[49,5,49,9],[38,3,38,4],[38,5,38,9],[39,3,39,4],[39,5,39,9],[40,3,40,4],[40,5,40,9],[41,3,41,4],[41,5,41,9],[42,3,42,4],[42,5,42,9],[43,3,43,4],[43,5,43,9],[44,3,44,4],[44,5,44,9],[45,3,45,4],[45,5,45,9],[46,3,46,4],[46,5,46,9],[38,11,38,13],[39,11,39,12],[40,11,40,12],[41,11,41,12],[42,11,42,12],[50,11,50,12],[51,11,51,12],[43,11,43,12],[46,11,46,12],[47,11,47,12],[48,11,48,12],[49,11,49,12],[44,11,44,12],[45,11,45,12]]}
["Ambassador #","Ambassador Name\n(Assured Seat)","Payments",null,null,null,null,null,null,"Expenses",null,null,null,null,null,null,null,null,"Balance","Exchange rate","Comments"]
[null,null,"Journey Registration Fee","Assured Space Deposit","FFI Fee $Cdn ","Host 1 Program Fee $Cdn ","Host 2 Program Fee $Cdn ",null,"FFI Fee $Cdn ","Host 1 Program Fee $Cdn ","Host 2 Program Fee $Cdn ",null,null,null,null,"Shared cost Items","Transfer to FFO","Refund"]
[1,null,0,0,0,0,0,0,0,0,0,0,0,0,0,0,0,0,{"$f":"ROUND(SUM(C3:H3),2)-ROUND(SUM(I3:R3),2)","v":0}]
[2,null,0,0,0,0,0,0,0,0,0,0,0,0,0,0,0,0,{"$f":"ROUND(SUM(C4:H4),2)-ROUND(SUM(I4:R4),2)","v":0}]
[3,null,0,0,0,0,0,0,0,0,0,0,0,0,0,0,0,0,0]
[4,null,0,0,0,0,0,0,0,0,0,0,0,0,0,0,0,0,0]
[5,null,0,0,0,0,0,0,0,0,0,0,0,0,0,0,0,0,0]
[6,null,0,0,0,0,0,0,0,0,0,0,0,0,0,0,0,0,0]
{"$rows_left_out":50}
{"sheet":"Inbound Details","index":4,"n_rows":77,"n_cols":13,"rows_kept":77,"cut":false,"hidden":false,"merged":[[0,10,1,10],[0,11,1,11],[0,12,1,12],[73,4,73,6],[73,1,73,3],[74,2,74,4],[75,3,75,5],[74,5,74,7],[73,7,73,9],[74,8,74,10],[75,6,75,8],[75,9,75,11]]}
["Participant's Name","Welcome","Escapade Eskimo","Museum of History","Curling\nIce Fishing","Omega Park","Event name","Event name","Event name","Farewell","Total paid","Balance","Remarks"]
["(See instructions in L71)",13.96,54.81,19.12,2,37.803799999999995,"Cost/Pers.","Cost/Pers.","Cost/Pers.",40]
["HC",14,0,19,2,0,0,0,0,40,{"$f":"SUM(B3:J3)","v":75},{"$f":"ROUND(K3-SUMIF(B3:J3,\">0\",B$2:J$2),2)","v":-0.08}]
["Self",14,0,0,2,0,0,0,0,40,{"$f":"SUM(B4:J4)","v":56},0.04]
["NH3",14,0,0,2,0,0,0,0,40,56,0.04]
["HL",0,55,19,0,0,0,0,0,40,114,7.0000000000000007E-2]
["NH5",14,0,0,2,38,0,0,0,40,94,0.24]
["NH6",14,0,19,0,0,0,0,0,40,73,-0.08]
{"$rows_left_out":70}
{"sheet":"Inbound Budget Report","index":5,"n_rows":70,"n_cols":13,"rows_kept":70,"cut":false,"hidden":false,"merged":[[0,8,0,12],[1,8,1,12],[3,0,3,2],[4,0,4,2],[4,11,4,13],[3,3,3,5],[4,3,4,5],[3,11,3,13],[4,8,4,10],[3,8,3,10]]}
[null,null,null,null,null,null,null,null,"FF Saturnalia/41248/15 Ambassadors"]
[null,null,null,null,null,null,null,null,"Wednesday, 05 Feb to Wednesday, 12 Feb 2020"]
[]
["FFO HC Name: ",null,null,"Jane Doe",null,null,null,null,"Incoming AC Name: ",null,null,"John Smith"]
["FFO Journey Treasurer Name:",null,null,"Your name",null,null,null,null,"Incoming Treasurer Name:",null,null,"Joe Blow"]
[]
["Events # and Dates",null,null,"Events",null,null,null,null,null,"FFO Revenue"]
[null,"Expense  Items",null,null,"Attendance","Unit cost","Total",null,null,"Attendance",null,"Unit cost","Total"]
{"$rows_left_out":63}
{"sheet":"Welcome","index":6,"n_rows":78,"n_cols":14,"rows_kept":78,"cut":false,"hidden":false,"merged":[]}
[null,"2020-02-05",null,null,"In cell B1, enter the date in the format: day month year, such as: 25 Oct 2018."]
[null,{"$f":"IF(ISBLANK(B1),G19,IF(TYPE(B1)=1,G19&\" - \"&TEXT(B1,\"ddd\")&\", \"&TEXT(B1,\"dd mmm yyyy\"),\"Above date is invalid\"))","v":"Welcome - Wed, 05 Feb 2020"},null,null,null,null,null,{"$f":"\"In cell B2, to change the event name ''\"&G19&\"\"\", rename the tab\"","v":"In cell B2, to change the event name ''Welcome\", rename the tab"}]
[]
["Expenses",null,"Estimated $",null,"Source of Funds",null,null,null,"Estimated $",null,"Summary - Source and Use of Funds"]
[null,{"$f":"+B24","v":"Total Site"},{"$f":"+C24","v":150},null,null,null,{"$f":"+F20","v":"Total Admissions-Ambassadors"},null,{"$f":"+I20","v":358.88}]
[null,{"$f":"+B33","v":"Total Decorations"},{"$f":"+C33","v":0},null,null,null,{"$f":"+F30","v":"Total Admissions-Hosts"},null,{"$f":"+I30","v":140},null,null,{"$f":"+E4","v":"Source of Funds"},null,"Estimated $"]
[null,{"$f":"+B42","v":"Total Publicity"},{"$f":"+C42","v":0},null,null,null,{"$f":"+F40","v":"Total Miscellaneous Source of Funds"},null,{"$f":"+I40","v":0},null,null,null,{"$f":"+G5","v":"Total Admissions-Ambassadors"},{"$f":"+I5","v":358.88}]
[null,{"$f":"+B51","v":"Total Refreshments"},{"$f":"+C51","v":348.88},null,null,null,null,null,null,null,null,null,{"$f":"+G6","v":"Total Admissions-Hosts"},{"$f":"+I6","v":140}]
{"$rows_left_out":71}
{"sheet":"Escapade Eskimo","index":7,"n_rows":78,"n_cols":14,"rows_kept":78,"cut":false,"hidden":false,"merged":[]}
[null,"2020-02-06",null,null,"In cell B1, enter the date in the format: day month year, such as: 25 Oct 2018."]
[null,{"$f":"IF(ISBLANK(B1),G19,IF(TYPE(B1)=1,G19&\" - \"&TEXT(B1,\"ddd\")&\", \"&TEXT(B1,\"dd mmm yyyy\"),\"Above date is invalid\"))","v":"Escapade Eskimo - Thu, 06 Feb 2020"},null,null,null,null,null,{"$f":"\"In cell B2, to change the event name ''\"&G19&\"\"\", rename the tab\"","v":"In cell B2, to change the event name ''Escapade Eskimo\", rename the tab"}]
[]
["Expenses",null,"Estimated $",null,"Source of Funds",null,null,null,"Estimated $",null,"Summary - Source and Use of Funds"]
[null,{"$f":"+B24","v":"Total Site"},{"$f":"+C24","v":0},null,null,null,{"$f":"+F20","v":"Total Admissions-Ambassadors"},null,{"$f":"+I20","v":1280}]
[null,{"$f":"+B33","v":"Total Decorations"},{"$f":"+C33","v":0},null,null,null,{"$f":"+F30","v":"Total Admissions-Hosts"},null,{"$f":"+I30","v":275},null,null,{"$f":"+E4","v":"Source of Funds"},null,"Estimated $"]
[null,{"$f":"+B42","v":"Total Publicity"},{"$f":"+C42","v":0},null,null,null,{"$f":"+F40","v":"Total Miscellaneous Source of Funds"},null,{"$f":"+I40","v":0},null,null,null,{"$f":"+G5","v":"Total Admissions-Ambassadors"},{"$f":"+I5","v":1280}]
[null,{"$f":"+B51","v":"Total Refreshments"},{"$f":"+C51","v":200},null,null,null,null,null,null,null,null,null,{"$f":"+G6","v":"Total Admissions-Hosts"},{"$f":"+I6","v":275}]
{"$rows_left_out":71}
{"sheet":"Museum of History","index":8,"n_rows":78,"n_cols":15,"rows_kept":78,"cut":false,"hidden":false,"merged":[]}
[null,"2020-02-07",null,null,"In cell B1, enter the date in the format: day month year, such as: 25 Oct 2018."]
[null,{"$f":"IF(ISBLANK(B1),G19,IF(TYPE(B1)=1,G19&\" - \"&TEXT(B1,\"ddd\")&\", \"&TEXT(B1,\"dd mmm yyyy\"),\"Above date is invalid\"))","v":"Museum of History - Fri, 07 Feb 2020"},null,null,null,null,null,{"$f":"\"In cell B2, to change the event name ''\"&G19&\"\"\", rename the tab\"","v":"In cell B2, to change the event name ''Museum of History\", rename the tab"}]
[]
["Expenses",null,"Estimated $",null,"Source of Funds",null,null,null,"Estimated $",null,"Summary - Source and Use of Funds"]
[null,{"$f":"+B24","v":"Total Site"},{"$f":"+C24","v":320},null,null,null,{"$f":"+F20","v":"Total Admissions-Ambassadors"},null,{"$f":"+I20","v":580}]
[null,{"$f":"+B33","v":"Total Decorations"},{"$f":"+C33","v":0},null,null,null,{"$f":"+F30","v":"Total Admissions-Hosts"},null,{"$f":"+I30","v":95},null,null,{"$f":"+E4","v":"Source of Funds"},null,"Estimated $"]
[null,{"$f":"+B42","v":"Total Publicity"},{"$f":"+C42","v":0},null,null,null,{"$f":"+F40","v":"Total Miscellaneous Source of Funds"},null,{"$f":"+I40","v":0},null,null,null,{"$f":"+G5","v":"Total Admissions-Ambassadors"},{"$f":"+I5","v":580}]
[null,{"$f":"+B51","v":"Total Refreshments"},{"$f":"+C51","v":150},null,null,null,null,null,null,null,null,null,{"$f":"+G6","v":"Total Admissions-Hosts"},{"$f":"+I6","v":95}]
{"$rows_left_out":71}
{"sheet":"Curling-Ice fishing","index":9,"n_rows":78,"n_cols":14,"rows_kept":78,"cut":false,"hidden":false,"merged":[]}
[null,"2020-02-08",null,null,"In cell B1, enter the date in the format: day month year, such as: 25 Oct 2018."]
[null,{"$f":"IF(ISBLANK(B1),G19,IF(TYPE(B1)=1,G19&\" - \"&TEXT(B1,\"ddd\")&\", \"&TEXT(B1,\"dd mmm yyyy\"),\"Above date is invalid\"))","v":"Curling-Ice fishing - Sat, 08 Feb 2020"},null,null,null,null,null,{"$f":"\"In cell B2, to change the event name ''\"&G19&\"\"\", rename the tab\"","v":"In cell B2, to change the event name ''Curling-Ice fishing\", rename the tab"}]
[]
["Expenses",null,"Estimated $",null,"Source of Funds",null,null,null,"Estimated $",null,"Summary - Source and Use of Funds"]
[null,{"$f":"+B24","v":"Total Site"},{"$f":"+C24","v":274},null,null,null,{"$f":"+F20","v":"Total Admissions-Ambassadors"},null,{"$f":"+I20","v":532.98}]
[null,{"$f":"+B33","v":"Total Decorations"},{"$f":"+C33","v":0},null,null,null,{"$f":"+F30","v":"Total Admissions-Hosts"},null,{"$f":"+I30","v":18},null,null,{"$f":"+E4","v":"Source of Funds"},null,"Estimated $"]
[null,{"$f":"+B42","v":"Total Publicity"},{"$f":"+C42","v":0},null,null,null,{"$f":"+F40","v":"Total Miscellaneous Source of Funds"},null,{"$f":"+I40","v":0},null,null,null,{"$f":"+G5","v":"Total Admissions-Ambassadors"},{"$f":"+I5","v":532.98}]
[null,{"$f":"+B51","v":"Total Refreshments"},{"$f":"+C51","v":276.98},null,null,null,null,null,null,null,null,null,{"$f":"+G6","v":"Total Admissions-Hosts"},{"$f":"+I6","v":18}]
{"$rows_left_out":71}
{"sheet":"Winterlude","index":10,"n_rows":78,"n_cols":14,"rows_kept":78,"cut":false,"hidden":false,"merged":[]}
[null,"2020-02-09",null,null,"In cell B1, enter the date in the format: day month year, such as: 25 Oct 2018."]
[null,{"$f":"IF(ISBLANK(B1),G19,IF(TYPE(B1)=1,G19&\" - \"&TEXT(B1,\"ddd\")&\", \"&TEXT(B1,\"dd mmm yyyy\"),\"Above date is invalid\"))","v":"Winterlude - Sun, 09 Feb 2020"},null,null,null,null,null,{"$f":"\"In cell B2, to change the event name ''\"&G19&\"\"\", rename the tab\"","v":"In cell B2, to change the event name ''Winterlude\", rename the tab"}]
[]
["Expenses",null,"Estimated $",null,"Source of Funds",null,null,null,"Estimated $",null,"Summary - Source and Use of Funds"]
[null,{"$f":"+B24","v":"Total Site"},{"$f":"+C24","v":0},null,null,null,{"$f":"+F20","v":"Total Admissions-Ambassadors"},null,{"$f":"+I20","v":150}]
[null,{"$f":"+B33","v":"Total Decorations"},{"$f":"+C33","v":0},null,null,null,{"$f":"+F30","v":"Total Admissions-Hosts"},null,{"$f":"+I30","v":0},null,null,{"$f":"+E4","v":"Source of Funds"},null,"Estimated $"]
[null,{"$f":"+B42","v":"Total Publicity"},{"$f":"+C42","v":0},null,null,null,{"$f":"+F40","v":"Total Miscellaneous Source of Funds"},null,{"$f":"+I40","v":0},null,null,null,{"$f":"+G5","v":"Total Admissions-Ambassadors"},{"$f":"+I5","v":150}]
[null,{"$f":"+B51","v":"Total Refreshments"},{"$f":"+C51","v":150},null,null,null,null,null,null,null,null,null,{"$f":"+G6","v":"Total Admissions-Hosts"},{"$f":"+I6","v":0}]
{"$rows_left_out":71}
{"sheet":"Omega Park","index":11,"n_rows":78,"n_cols":14,"rows_kept":78,"cut":false,"hidden":false,"merged":[]}
[null,"2020-02-10",null,null,"In cell B1, enter the date in the format: day month year, such as: 25 Oct 2018."]
[null,{"$f":"IF(ISBLANK(B1),G19,IF(TYPE(B1)=1,G19&\" - \"&TEXT(B1,\"ddd\")&\", \"&TEXT(B1,\"dd mmm yyyy\"),\"Above date is invalid\"))","v":"Omega Park - Mon, 10 Feb 2020"},null,null,null,null,null,{"$f":"\"In cell B2, to change the event name ''\"&G19&\"\"\", rename the tab\"","v":"In cell B2, to change the event name ''Omega Park\", rename the tab"}]
[]
["Expenses",null,"Estimated $",null,"Source of Funds",null,null,null,"Estimated $",null,"Summary - Source and Use of Funds"]
[null,{"$f":"+B24","v":"Total Site"},{"$f":"+C24","v":342},null,null,null,{"$f":"+F20","v":"Total Admissions-Ambassadors"},null,{"$f":"+I20","v":1375}]
[null,{"$f":"+B33","v":"Total Decorations"},{"$f":"+C33","v":0},null,null,null,{"$f":"+F30","v":"Total Admissions-Hosts"},null,{"$f":"+I30","v":152},null,null,{"$f":"+E4","v":"Source of Funds"},null,"Estimated $"]
[null,{"$f":"+B42","v":"Total Publicity"},{"$f":"+C42","v":0},null,null,null,{"$f":"+F40","v":"Total Miscellaneous Source of Funds"},null,{"$f":"+I40","v":0},null,null,null,{"$f":"+G5","v":"Total Admissions-Ambassadors"},{"$f":"+I5","v":1375}]
[null,{"$f":"+B51","v":"Total Refreshments"},{"$f":"+C51","v":380},null,null,null,null,null,null,null,null,null,{"$f":"+G6","v":"Total Admissions-Hosts"},{"$f":"+I6","v":152}]
{"$rows_left_out":71}
{"sheet":"Parliament","index":12,"n_rows":78,"n_cols":14,"rows_kept":78,"cut":false,"hidden":false,"merged":[]}
[null,"2020-02-11",null,null,"In cell B1, enter the date in the format: day month year, such as: 25 Oct 2018."]
[null,{"$f":"IF(ISBLANK(B1),G19,IF(TYPE(B1)=1,G19&\" - \"&TEXT(B1,\"ddd\")&\", \"&TEXT(B1,\"dd mmm yyyy\"),\"Above date is invalid\"))","v":"Parliament - Tue, 11 Feb 2020"},null,null,null,null,null,{"$f":"\"In cell B2, to change the event name ''\"&G19&\"\"\", rename the tab\"","v":"In cell B2, to change the event name ''Parliament\", rename the tab"}]
[]
["Expenses",null,"Estimated $",null,"Source of Funds",null,null,null,"Estimated $",null,"Summary - Source and Use of Funds"]
[null,{"$f":"+B24","v":"Total Site"},{"$f":"+C24","v":0},null,null,null,{"$f":"+F20","v":"Total Admissions-Ambassadors"},null,{"$f":"+I20","v":150}]
[null,{"$f":"+B33","v":"Total Decorations"},{"$f":"+C33","v":0},null,null,null,{"$f":"+F30","v":"Total Admissions-Hosts"},null,{"$f":"+I30","v":0},null,null,{"$f":"+E4","v":"Source of Funds"},null,"Estimated $"]
[null,{"$f":"+B42","v":"Total Publicity"},{"$f":"+C42","v":0},null,null,null,{"$f":"+F40","v":"Total Miscellaneous Source of Funds"},null,{"$f":"+I40","v":0},null,null,null,{"$f":"+G5","v":"Total Admissions-Ambassadors"},{"$f":"+I5","v":150}]
[null,{"$f":"+B51","v":"Total Refreshments"},{"$f":"+C51","v":150},null,null,null,null,null,null,null,null,null,{"$f":"+G6","v":"Total Admissions-Hosts"},{"$f":"+I6","v":0}]
{"$rows_left_out":71}
{"sheet":"Event 8","index":13,"n_rows":78,"n_cols":14,"rows_kept":78,"cut":false,"hidden":false,"merged":[]}
[null,null,null,null,"In cell B1, enter the date in the format: day month year, such as: 25 Oct 2018."]
[null,{"$f":"IF(ISBLANK(B1),G19,IF(TYPE(B1)=1,G19&\" - \"&TEXT(B1,\"ddd\")&\", \"&TEXT(B1,\"dd mmm yyyy\"),\"Above date is invalid\"))","v":"Event 8"},null,null,null,null,null,{"$f":"\"In cell B2, to change the event name ''\"&G19&\"\"\", rename the tab\"","v":"In cell B2, to change the event name ''Event 8\", rename the tab"}]
[]
["Expenses",null,"Estimated $",null,"Source of Funds",null,null,null,"Estimated $",null,"Summary - Source and Use of Funds"]
[null,{"$f":"+B24","v":"Total Site"},{"$f":"+C24","v":0},null,null,null,{"$f":"+F20","v":"Total Admissions-Ambassadors"},null,{"$f":"+I20","v":0}]
[null,{"$f":"+B33","v":"Total Decorations"},{"$f":"+C33","v":0},null,null,null,{"$f":"+F30","v":"Total Admissions-Hosts"},null,{"$f":"+I30","v":0},null,null,{"$f":"+E4","v":"Source of Funds"},null,"Estimated $"]
[null,{"$f":"+B42","v":"Total Publicity"},{"$f":"+C42","v":0},null,null,null,{"$f":"+F40","v":"Total Miscellaneous Source of Funds"},null,{"$f":"+I40","v":0},null,null,null,{"$f":"+G5","v":"Total Admissions-Ambassadors"},{"$f":"+I5","v":0}]
[null,{"$f":"+B51","v":"Total Refreshments"},{"$f":"+C51","v":0},null,null,null,null,null,null,null,null,null,{"$f":"+G6","v":"Total Admissions-Hosts"},{"$f":"+I6","v":0}]
{"$rows_left_out":71}
{"sheet":"Farewell","index":14,"n_rows":78,"n_cols":14,"rows_kept":78,"cut":false,"hidden":false,"merged":[]}
[null,"2020-02-11",null,null,"In cell B1, enter the date in the format: day month year, such as: 25 Oct 2018."]
[null,{"$f":"IF(ISBLANK(B1),G19,IF(TYPE(B1)=1,G19&\" - \"&TEXT(B1,\"ddd\")&\", \"&TEXT(B1,\"dd mmm yyyy\"),\"Above date is invalid\"))","v":"Farewell - Tue, 11 Feb 2020"},null,null,null,null,null,{"$f":"\"In cell B2, to change the event name ''\"&G19&\"\"\", rename the tab\"","v":"In cell B2, to change the event name ''Farewell\", rename the tab"}]
[]
["Expenses",null,"Estimated $",null,"Source of Funds",null,null,null,"Estimated $",null,"Summary - Source and Use of Funds"]
[null,{"$f":"+B24","v":"Total Site"},{"$f":"+C24","v":0},null,null,null,{"$f":"+F20","v":"Total Admissions-Ambassadors"},null,{"$f":"+I20","v":600}]
[null,{"$f":"+B33","v":"Total Decorations"},{"$f":"+C33","v":0},null,null,null,{"$f":"+F30","v":"Total Admissions-Hosts"},null,{"$f":"+I30","v":600},null,null,{"$f":"+E4","v":"Source of Funds"},null,"Estimated $"]
[null,{"$f":"+B42","v":"Total Publicity"},{"$f":"+C42","v":0},null,null,null,{"$f":"+F40","v":"Total Miscellaneous Source of Funds"},null,{"$f":"+I40","v":0},null,null,null,{"$f":"+G5","v":"Total Admissions-Ambassadors"},{"$f":"+I5","v":600}]
[null,{"$f":"+B51","v":"Total Refreshments"},{"$f":"+C51","v":1200},null,null,null,null,null,null,null,null,null,{"$f":"+G6","v":"Total Admissions-Hosts"},{"$f":"+I6","v":600}]
{"$rows_left_out":71}
{"sheet":"SUMMARY-SOURCE & USE OF FUNDS","index":15,"n_rows":45,"n_cols":6,"rows_kept":45,"cut":false,"hidden":false,"merged":[]}
["Summary - Source and Use of Funds"]
[]
[null,"Source of Funds",null,"Estimated $","Actual $","Variance"]
[null,null,"Ambassador Receipts",{"$f":"IF(BUDGET!I40=\"\",0,BUDGET!I40)","v":5405.8600000000006},{"$f":"Journal!F84","v":5285.8},{"$f":"ROUND(E4-D4,2)","v":-120.06}]
[null,null,"Host Receipts",{"$f":"IF(BUDGET!L40=\"\",0,BUDGET!L40)","v":1280},{"$f":"Journal!F85","v":1280},{"$f":"ROUND(E5-D5,2)","v":0}]
[null,null,"Miscellaneous Receipts",{"$f":"IF(BUDGET!O40=\"\",0,BUDGET!O40)","v":0},{"$f":"Journal!F86","v":0},0]
[null,null,"Total Source of Funds",{"$f":"SUM(D4:D6)","v":6685.8600000000006},{"$f":"SUM(E4:E6)","v":6565.8},{"$f":"ROUND(SUM(F4:F6),2)","v":-120.06}]
[]
{"$rows_left_out":37}